<ol id="1e2ww"></ol>
    1. <ol id="1e2ww"></ol>

      1. 無標題文檔
        wdCP系統 (介紹,功能特性,運行環境,安裝說明,演示,常見問題,使用教程) wdCDN系統 (介紹,功能特性,運行環境,安裝說明,演示,常見問題,使用手冊)
        wdOS系統 (介紹,功能特性,運行環境,安裝說明,演示,常見問題,使用教程) wdDNS系統 (介紹,功能特性,運行環境,安裝說明,演示,常見問題,使用手冊)
        注冊 發貼 提問 回復-必看必看 wddns免費智能 DNS 開通 本地或虛擬機使 用wdcp 一鍵包在mysql編 譯時"卡住"
        【300G高防】雙線 無視攻擊 wdcp官方技術支持/服務 阿里云8折優惠券 無敵云 騰訊云優惠中,現注冊更有260代金額券贈送
        人妻精品久久久久中文字幕2018,亚洲日韩线精品一区一区一区,日韩精品中文字幕亚洲第一页,日本黄色一级aaaaaa

        <ol id="1e2ww"></ol>
      2. <ol id="1e2ww"></ol>

        返回列表 發帖
        提問三步曲: 提問先看教程/FAQ索引(wdcp,wdcp_v3,一鍵包)及搜索,會讓你更快解決問題
        1 提供詳細,如系統版本,wdcp版本,軟件版本等及錯誤的詳細信息,貼上論壇或截圖發論壇
        2 做過哪些操作或改動設置等

        溫馨提示:信息不詳,很可能會沒人理你!論壇有教程說明的,也可能沒人理!因為,你懂的

        [求助] 請教當前自動腳本新安裝時出現libevent openssl問題

        已經多次測試新裝centos7.6或OpenCloudOS release 8.8.2305,更換了多種php或mysql版本,查似乎是libevent openssl兩者對應版本問題,但不得其法,特此請教,謝謝!

        bufferevent_openssl.c: In function 'bio_bufferevent_new':
        bufferevent_openssl.c:106:3: error: dereferencing pointer to incomplete type 'BIO' {aka 'struct bio_st'}
          b->init = 0;
           ^~
        bufferevent_openssl.c: At top level:
        bufferevent_openssl.c:228:1: error: variable 'methods_bufferevent' has initializer but incomplete type
        static BIO_METHOD methods_bufferevent = {
        ^~~~~~
        bufferevent_openssl.c:79:27: warning: excess elements in struct initializer
        #define BIO_TYPE_LIBEVENT 57
                                   ^~
        bufferevent_openssl.c:229:2: note: in expansion of macro 'BIO_TYPE_LIBEVENT'
          BIO_TYPE_LIBEVENT, "bufferevent",
          ^~~~~~~~~~~~~~~~~
        bufferevent_openssl.c:79:27: note: (near initialization for 'methods_bufferevent')
        #define BIO_TYPE_LIBEVENT 57
                                   ^~
        bufferevent_openssl.c:229:2: note: in expansion of macro 'BIO_TYPE_LIBEVENT'
          BIO_TYPE_LIBEVENT, "bufferevent",
          ^~~~~~~~~~~~~~~~~
        bufferevent_openssl.c:229:21: warning: excess elements in struct initializer
          BIO_TYPE_LIBEVENT, "bufferevent",
                             ^~~~~~~~~~~~~
        bufferevent_openssl.c:229:21: note: (near initialization for 'methods_bufferevent')
        bufferevent_openssl.c:230:2: warning: excess elements in struct initializer
          bio_bufferevent_write,
          ^~~~~~~~~~~~~~~~~~~~~
        bufferevent_openssl.c:230:2: note: (near initialization for 'methods_bufferevent')
        bufferevent_openssl.c:231:2: warning: excess elements in struct initializer
          bio_bufferevent_read,
          ^~~~~~~~~~~~~~~~~~~~
        bufferevent_openssl.c:231:2: note: (near initialization for 'methods_bufferevent')
        bufferevent_openssl.c:232:2: warning: excess elements in struct initializer
          bio_bufferevent_puts,
          ^~~~~~~~~~~~~~~~~~~~
        bufferevent_openssl.c:232:2: note: (near initialization for 'methods_bufferevent')
        bufferevent_openssl.c:233:2: warning: excess elements in struct initializer
          NULL /* bio_bufferevent_gets */,
          ^~~~
        bufferevent_openssl.c:233:2: note: (near initialization for 'methods_bufferevent')
        bufferevent_openssl.c:234:2: warning: excess elements in struct initializer
          bio_bufferevent_ctrl,
          ^~~~~~~~~~~~~~~~~~~~
        bufferevent_openssl.c:234:2: note: (near initialization for 'methods_bufferevent')
        bufferevent_openssl.c:235:2: warning: excess elements in struct initializer
          bio_bufferevent_new,
          ^~~~~~~~~~~~~~~~~~~
        bufferevent_openssl.c:235:2: note: (near initialization for 'methods_bufferevent')
        bufferevent_openssl.c:236:2: warning: excess elements in struct initializer
          bio_bufferevent_free,
          ^~~~~~~~~~~~~~~~~~~~
        bufferevent_openssl.c:236:2: note: (near initialization for 'methods_bufferevent')
        bufferevent_openssl.c:237:2: warning: excess elements in struct initializer
          NULL /* callback_ctrl */,
          ^~~~
        bufferevent_openssl.c:237:2: note: (near initialization for 'methods_bufferevent')
        bufferevent_openssl.c:228:19: error: storage size of 'methods_bufferevent' isn't known
        static BIO_METHOD methods_bufferevent = {
                           ^~~~~~~~~~~~~~~~~~~
        make[2]: *** [Makefile:800: bufferevent_openssl.lo] Error 1
        make[2]: *** Waiting for unfinished jobs....
        libtool: link: ranlib .libs/libevent_extra.a
        libtool: link: ( cd ".libs" && rm -f "libevent_extra.la" && ln -s "../libevent_extra.la" "libevent_extra.la" )
        make[2]: Leaving directory '/root/src/libevent-2.0.22-stable'
        make[1]: *** [Makefile:864: all-recursive] Error 1
        make[1]: Leaving directory '/root/src/libevent-2.0.22-stable'
        make: *** [Makefile:595: all] Error 2


        x86_64
        OpenCloudOS release 8.8.2305 (Core)
        ----Install Error: libevent make err -----------
        yunhai.cc

        返回列表